Forum posts

Posted 4 years ago2017-11-16 10:43:02 UTC
in Use HTTP Secure to protect login informa Post #338064
worth mentioning the Global mass Surveillance of 2013
Posted 4 years ago2017-11-12 03:52:03 UTC
in Use HTTP Secure to protect login informa Post #338024
Hi, this site does not use SSL HTTP Secure Protocol which will endanger the login credentials and other things of the users. Anything can be sniffed using a program example (Wireshark) Please use a SSL Certificate to secure the site, you can get a free SSL certificate from Let's Encrypt. Thank you
Posted 10 years ago2012-04-18 01:11:44 UTC
in does somebody has this zombie model? Post #305474
I am browsing the VERC archive and i found this link
http://twhl.info/articulator.php?art=163
but the problem is the modified zombie model is not available to download, it says "Not Found" (dead link) i am just wondering if any of you has that model, Thanks
Posted 10 years ago2012-04-17 08:05:43 UTC
in help fixing this code Post #305453
this error is in combat.cpp
Posted 10 years ago2012-04-17 07:36:25 UTC
in help fixing this code Post #305451
I have used the 'WayBack Machine' to browse the planethalflife archive and I have found that there is that ' Frag Points when you kill a monster in mp' but I cannot get that code to work it says that:
'pPlayer' : undeclared identifier
this is the link to the planethalflife
http://web.archive.org/web/20050310084202/http://www.planethalflife.com/hlprogramming/tutorial.asp?i=143

I am using MS Visual C++ Express 2010
Posted 10 years ago2012-04-17 06:49:10 UTC
in help fixing this code Post #305449
I added this code in combat.cpp
#include "player.h"

in the CBaseMonster::Killed

if( pPlayer && pPlayer->IsPlayer() ) //pPlayer undefined...
{
pPlayer->AddPoints( 1, false );
}
Posted 10 years ago2012-04-15 02:00:17 UTC
in how to create a medic? Post #305401
well, i want to create a medic NPC just like in Opposing Force that can heal NPC's and Players
Posted 10 years ago2012-04-14 10:48:24 UTC
in how to create a medic? Post #305374
you're right i don't know how to heal fellow NPC's
Posted 10 years ago2012-04-14 10:04:28 UTC
in how to create a medic? Post #305372
Hello, i am looking at the code in scientist and now i want to create a H.E.C.U. like Medic but I don't know that that will heal other AI's, please help me with that code, thanks
Posted 10 years ago2012-03-29 07:26:47 UTC
in help to create better thirdperson in hl Post #304750
thanks
Posted 10 years ago2012-03-29 05:17:00 UTC
in help to create better thirdperson in hl Post #304748
sorry but im not talking about the model, I was talking about the code, if you type the 'thirdperson' in console you will see that the thirdperson is not good, it will give you a side view
Posted 10 years ago2012-03-29 04:45:53 UTC
in help to create better thirdperson in hl Post #304746
hello, can someone help me to create better thirdperson view in half-life, you can view thirdperson in half-life by typing thirdperson in the console, please help me, I am usinf the Half-life SDK 2.3 (not using Spirit of Half-life)
Posted 10 years ago2012-02-12 12:58:10 UTC
in need models.... Post #303323
did somebody created a nightvision goggles model for half-life goldsrc?
i need these, thanks in advanced! :) :) :) :) :)
Posted 10 years ago2011-11-25 14:43:06 UTC
in New Mod: Half-Life: History Post #301047
@Captain Terror exit the popups or use a adblocker, the exe is a SFX (self-extracting archive) AND NOT A INSTALLER, i only used exe by KGB archiver to compress the files inside the mod because it use a lot of memory, or simply I compressed the whole mod.....
Posted 10 years ago2011-11-21 14:26:00 UTC
in New Mod: Half-Life: History Post #300945
uhh, mediafire works well for me....
Posted 10 years ago2011-11-21 02:25:17 UTC
in New Mod: Half-Life: History Post #300939
the game mod can be downloaded with my maps:
http://www.mediafire.com/?ua2bo5xb968ggus
password is: hs
Posted 10 years ago2011-11-18 13:50:09 UTC
in New Mod: Half-Life: History Post #300876
sorry i dont check my messages regularly, check my message now :)
Posted 10 years ago2011-11-17 12:44:41 UTC
in New Mod: Half-Life: History Post #300849
im working on prgramming not mapping
Posted 10 years ago2011-11-16 13:56:42 UTC
in New Mod: Half-Life: History Post #300816
about last March , ok
Posted 10 years ago2011-11-16 09:28:43 UTC
in New Mod: Half-Life: History Post #300810
i already have a website but i still not posting a complete site.....
it says that the site is underconstruction
[url]http://www.history.half-lifecreations.com/[url]
Posted 10 years ago2011-11-16 09:25:45 UTC
in New Mod: Half-Life: History Post #300809
@mighty atom thats why i need a mapper because i dont have skills in mapping, and i used the uplink map
@discostu
on the programming part in my file date: Friday, August 12, 2011, 3:31:06 PM
to Wednesday, September 28, 2011, 6:17:11 PM

on mapping mission1 to mission6
date: Friday, August 05, 2011, 10:09:01 PM to Sunday, September 04, 2011, 2:40:19 PM
Posted 10 years ago2011-11-15 09:19:53 UTC
in New Mod: Half-Life: History Post #300779
User posted image


User posted image


User posted image


User posted image


User posted image


User posted image


User posted image


User posted image


User posted image


User posted image


User posted image


User posted image


User posted image


User posted image


somme screenshots are still not uploaded
Posted 10 years ago2011-11-14 22:12:29 UTC
in New Mod: Half-Life: History Post #300766
the story is half completed, it is related to G-man and the crystalline object, The military costume should be changed, thank you, you can be part of my team just contact me @ gianpaolomapacpac@yahoo.com
Posted 10 years ago2011-11-14 08:34:15 UTC
in New Mod: Half-Life: History Post #300755
the maps and other resources i will upload it later, im doing my assignment
Posted 10 years ago2011-11-14 08:32:34 UTC
in New Mod: Half-Life: History Post #300754
the password is "hs" without quotes, i cant upload to imageshack because it will display invalid/unregistered url
Posted 10 years ago2011-11-13 13:37:31 UTC
in The Voice Acting Thread Post #300729
I also need a voice actor to my new and big mode:
Threas Title: New Mod: Half-Life:History
need voice for:
Vox
Barney
Scientist
Construction
Computer
Posted 10 years ago2011-11-13 13:34:45 UTC
in New Mod: Half-Life: History Post #300728
Ok, I have a lot of screenshots saved in the PDF and packed in a exe kgb file due to large amount of files.
Download Here: http://www.mediafire.com/?9qd99cwgqigrrcv
name: hs-scr.exe
You need Adobe Reader/Foxit Reader to open extracted pdf file
Posted 10 years ago2011-11-13 08:32:08 UTC
in New Mod: Half-Life: History Post #300721
screenshots are coming, please wait
Posted 10 years ago2011-11-13 03:37:06 UTC
in New Mod: Half-Life: History Post #300712
I haven't done mapping, and the weapons are still not done:
WEAPONS:
  • WEAPON KNIFE (WORKING ONLY IN MP)
  • WEAPON HAMMER (NOT YET ADDED)
  • WEAPON SCREWDRIVER (NOT YET ADDED)
  • PIPE WRENCH (NOT YET ADDED)
  • NIGHT VISION GOGGLES (NOT YET ADDED)
  • MEDKIT (NOT YET ADDED)
  • M16 (NOT YET ADDED)
  • BACKPACK TURRET (NOT YET ADDED)
  • RADAR (BUG!!)
  • FIST(NOT YET ADDED) NEED MODEL
@dimbark you can also be part of the team
i need voice actors of Barney , Construction , Scientist
model are only need to be edited...
Thanks,

contact me @ gianpaolomapacpac@yahoo.com

:) :)

____________________________________________

MY MAPS SUCKS!
I DONT HAVE TASTE IN DESIGN.... :)
Posted 10 years ago2011-11-12 13:29:29 UTC
in New Mod: Half-Life: History Post #300684
Hellow, I am currently creating new Half-life 1 Mod: Title:
Half-Life:History
I need mappers, modellers, coders.
I coded the following...

HALF-LIFE: HISTORY

LOCATION:
BLACK MESA TEST SITE, BLACK MESA

STORY:
The underconstruction Black Mesa Test Site will undergo a Missile Test. A construction worker (NAME SURNAME) GUS ANDERSON
is on shift and will fix a little problem in Sub Level 1, when the missile test happened, suddenly a asteroid or UFO hit the missile
the radars did'nt detect that it hit a asteroid(simply the asteroid came from nowhere), the missile exploded, no one knews that the
missile carries a nuclear warhead, the nuclear warhead exploded, Anderson is in the Sub Level 1 Elevator with a pressure cabin, the missile's
radiation did not get in the elevator, but the backup systems failed the pressure cabin is decompressing, Anderson must go down using the ladder
to prevent the contamination from radiation, when he is saved, he notice that the backup power must be activated, in the help of a old
construction worker help, he went to the Generator Room and turned on the backup power and 2 aliens teleported or came from nowhere.
He also need more help in saving those scientist, construction worker and human grunts did'nt get contaminated from radiation. He must
contact the millitary to rescue all survivors, millitary rescued all survivors, it was Anderson's turn when a massive alien attack happened
Anderson survived but all the millitary troops and helicopter are all DEAD, he was teleported back with aliens, without a weapon, Anderson
found out that he is not alone, some millitary survivors also teleported, he must get weapons and stuffs. He is again teleported back to Earth
on a Laboratory with other Grunts Teleported too. All of a sudden, many aliens also teleported in the lab thus, all of the grunts and scientist
are teleported to a unknown place, he also saw G-man used the teleporter machine and he is also teleported to a place.

NIGHT AT BLACK MESA... COMING SOON....

FGD FILE:
hs.fgd

MONSTERS:

ORIGINAL HALF-LIFE FGD + :
  • ALIEN UNSLAVE
  • OTIS
  • HUMAN GRUNT(FRIEND)
  • TURRET(FRIEND)
  • SENTRYTURRET(FRIEND)
  • BARNEYZOMBIE
  • SOLDIERZOMBIE
  • GONOME
  • PITDRONE
  • BLACK OPS APACHE
  • BLACK OPS OSPREY
  • FRIENDLY HEADCRAB
  • FRIENDLY ZOMBIE
  • CONSTRUCTION WORKER (MAIN CHARACTER)
  • CONSTRUCTION WORKER DEAD
  • SITTING CONSTRUCTION WORKER
  • FAST HEADCRAB
  • FAST ZOMBIE (NOT IN HL2)
  • BARNEY (ARMED WITH 357/REVOLVER)
  • FRANK(EX-MILLITARY/CIVILIAN)
  • MALE ASSASSIN (SLOW/ONLY ENEMY)
  • COUNTER TERRORIST GRUNT(FRIEND) - PLANNING
  • TERRORIST GRUNT (ENEMY) - PLANNING
  • COUNTER TERRORIST OSPREY (BUG)
  • VOLTIGORE(BUG)
  • CIVILIAN
  • BIG HOUNDEYE
WEAPONS:
  • WEAPON KNIFE
  • WEAPON HAMMER
  • WEAPON SCREWDRIVER
  • PIPE WRENCH
  • NIGHT VISION GOGGLES
  • MEDKIT
  • M16
  • BACKPACK TURRET
  • RADAR
  • FIST
EXTRA:
  • KEYPAD
NEED VOICES FOR:
  • BARNEY
  • CONSTRUCTION WORKER
  • SCIENTIST
  • FRANK
  • COUNTER TERRORIST
  • TERRORIST
  • CIVILIAN
What do you think?
Posted 10 years ago2011-09-15 05:07:17 UTC
in remove HEV weaponstrip code? Post #298955
Thanks a lot! :):):):):)
I saw that code, and my mind is questioning it why it is FALSE not TRUE!
hahaha
Tnx!
Posted 10 years ago2011-09-15 03:05:20 UTC
in remove HEV weaponstrip code? Post #298951
How to remove the H.E.V using the player_weaponstrip?
I cant figure out the code that will remove the H.E.V from the player, using the player_weaponstrip in the Valve Hammer 3.5...

Half-life SDK 2.3
Posted 10 years ago2011-08-20 10:37:32 UTC
in create a radar in half-life sdk? Post #298235
I got an error on these code:
HSPRITE m_hRadarSpr; // Background image for the radar //> can be found hud.h line 686
DECLARE_MESSAGE( m_HudRadar, HudRadar); //> can be found hud.h line 689

In the server side

1>------ Build started: Project: hs, Configuration: Debug Win32 ----
1> player.cpp
1>d:new folder (2)hlsdk23_msvc20081src_dlldllsplayer.cpp(2565): error C2065: 'gmsgHudRadar' : undeclared identifier
Build: 0 succeeded, 1 failed, 0 up-to-date, 0 skipped
error on the code:

// Send coordinates to CHudRadar to draw
MESSAGE_BEGIN( MSG_ONE, gmsgHudRadar, NULL, pev ); // Set the message parameters - what type of msg + where to send
Posted 10 years ago2011-08-20 10:35:01 UTC
in create a radar in half-life sdk? Post #298234
1>------ Build started: Project: cl_dll, Configuration: Debug Win32 ----
1> view.cpp
1>d:new folder (2)hlsdk23_msvc20081src_dllcl_dllhud.h(686): error C2146: syntax error : missing ';' before identifier 'm_hRadarSpr'
1>d:new folder (2)hlsdk23_msvc20081src_dllcl_dllhud.h(686): error C4430: missing type specifier - int assumed. Note: C++ does not support default-int
1>d:new folder (2)hlsdk23_msvc20081src_dllcl_dllhud.h(686): error C4430: missing type specifier - int assumed. Note: C++ does not support default-int
1>d:new folder (2)hlsdk23_msvc20081src_dllcl_dllhud.h(689): error C2065: 'm_HudRadar' : undeclared identifier
1>d:new folder (2)hlsdk23_msvc20081src_dllcl_dllhud.h(689): error C2065: 'HudRadar' : undeclared identifier
1>d:new folder (2)hlsdk23_msvc20081src_dllcl_dllhud.h(689): error C4430: missing type specifier - int assumed. Note: C++ does not support default-int
1>d:new folder (2)hlsdk23_msvc20081src_dllcl_dllhud.h(689): error C2078: too many initializers
1>d:new folder (2)hlsdk23_msvc20081src_dllcl_dllhud.h(698): error C2065: 'HudRadar' : undeclared identifier
1>d:new folder (2)hlsdk23_msvc20081src_dllcl_dllhud.h(698): error C3861: 'HOOK_MESSAGE': identifier not found
1>d:new folder (2)hlsdk23_msvc20081src_dllcl_dllhud.h(709): error C3861: 'UnpackRGB': identifier not found
1>d:new folder (2)hlsdk23_msvc20081src_dllcl_dllhud.h(722): error C2065: 'm_hRadarSpr' : undeclared identifier
1>d:new folder (2)hlsdk23_msvc20081src_dllcl_dllhud.h(731): error C3861: 'BEGIN_READ': identifier not found
1>d:new folder (2)hlsdk23_msvc20081src_dllcl_dllhud.h(734): error C3861: 'READ_BYTE': identifier not found
1>d:new folder (2)hlsdk23_msvc20081src_dllcl_dllhud.h(739): error C3861: 'READ_BYTE': identifier not found
1>d:new folder (2)hlsdk23_msvc20081src_dllcl_dllhud.h(740): error C3861: 'READ_BYTE': identifier not found
1>d:new folder (2)hlsdk23_msvc20081src_dllcl_dllhud.h(749): error C2065: 'm_hRadarSpr' : undeclared identifier
1>d:new folder (2)hlsdk23_msvc20081src_dllcl_dllhud.h(751): error C2065: 'm_hRadarSpr' : undeclared identifier
1>d:new folder (2)hlsdk23_msvc20081src_dllcl_dllhud.h(751): error C3861: 'LoadSprite': identifier not found
1>d:new folder (2)hlsdk23_msvc20081src_dllcl_dllhud.h(767): error C2065: 'm_hRadarSpr' : undeclared identifier
1>d:new folder (2)hlsdk23_msvc20081src_dllcl_dllhud.h(767): error C3861: 'SPR_Set': identifier not found
1>d:new folder (2)hlsdk23_msvc20081src_dllcl_dllhud.h(768): error C3861: 'SPR_DrawHoles': identifier not found
1> vgui_teammenu.cpp
1>d:new folder (2)hlsdk23_msvc20081src_dllcl_dllhud.h(686): error C2146: syntax error : missing ';' before identifier 'm_hRadarSpr'
1>d:new folder (2)hlsdk23_msvc20081src_dllcl_dllhud.h(686): error C4430: missing type specifier - int assumed. Note: C++ does not support default-int
1>d:new folder (2)hlsdk23_msvc20081src_dllcl_dllhud.h(686): error C4430: missing type specifier - int assumed. Note: C++ does not support default-int
1>d:new folder (2)hlsdk23_msvc20081src_dllcl_dllhud.h(689): error C2065: 'm_HudRadar' : undeclared identifier
1>d:new folder (2)hlsdk23_msvc20081src_dllcl_dllhud.h(689): error C2065: 'HudRadar' : undeclared identifier
1>d:new folder (2)hlsdk23_msvc20081src_dllcl_dllhud.h(689): error C4430: missing type specifier - int assumed. Note: C++ does not support default-int
1>d:new folder (2)hlsdk23_msvc20081src_dllcl_dllhud.h(689): error C2078: too many initializers
1>d:new folder (2)hlsdk23_msvc20081src_dllcl_dllhud.h(698): error C2065: 'HudRadar' : undeclared identifier
1>d:new folder (2)hlsdk23_msvc20081src_dllcl_dllhud.h(698): error C3861: 'HOOK_MESSAGE': identifier not found
1>d:new folder (2)hlsdk23_msvc20081src_dllcl_dllhud.h(709): error C3861: 'UnpackRGB': identifier not found
1>d:new folder (2)hlsdk23_msvc20081src_dllcl_dllhud.h(722): error C2065: 'm_hRadarSpr' : undeclared identifier
1>d:new folder (2)hlsdk23_msvc20081src_dllcl_dllhud.h(731): error C3861: 'BEGIN_READ': identifier not found
1>d:new folder (2)hlsdk23_msvc20081src_dllcl_dllhud.h(734): error C3861: 'READ_BYTE': identifier not found
1>d:new folder (2)hlsdk23_msvc20081src_dllcl_dllhud.h(739): error C3861: 'READ_BYTE': identifier not found
1>d:new folder (2)hlsdk23_msvc20081src_dllcl_dllhud.h(740): error C3861: 'READ_BYTE': identifier not found
1>d:new folder (2)hlsdk23_msvc20081src_dllcl_dllhud.h(749): error C2065: 'm_hRadarSpr' : undeclared identifier
1>d:new folder (2)hlsdk23_msvc20081src_dllcl_dllhud.h(751): error C2065: 'm_hRadarSpr' : undeclared identifier
1>d:new folder (2)hlsdk23_msvc20081src_dllcl_dllhud.h(751): error C3861: 'LoadSprite': identifier not found
1>d:new folder (2)hlsdk23_msvc20081src_dllcl_dllhud.h(767): error C2065: 'm_hRadarSpr' : undeclared identifier
1>d:new folder (2)hlsdk23_msvc20081src_dllcl_dllhud.h(767): error C3861: 'SPR_Set': identifier not found
1>d:new folder (2)hlsdk23_msvc20081src_dllcl_dllhud.h(768): error C3861: 'SPR_DrawHoles': identifier not found
1> vgui_int.cpp
1>d:new folder (2)hlsdk23_msvc20081src_dllcl_dllhud.h(686): error C2146: syntax error : missing ';' before identifier 'm_hRadarSpr'
1>d:new folder (2)hlsdk23_msvc20081src_dllcl_dllhud.h(686): error C4430: missing type specifier - int assumed. Note: C++ does not support default-int
1>d:new folder (2)hlsdk23_msvc20081src_dllcl_dllhud.h(686): error C4430: missing type specifier - int assumed. Note: C++ does not support default-int
1>d:new folder (2)hlsdk23_msvc20081src_dllcl_dllhud.h(689): error C2065: 'm_HudRadar' : undeclared identifier
1>d:new folder (2)hlsdk23_msvc20081src_dllcl_dllhud.h(689): error C2065: 'HudRadar' : undeclared identifier
1>d:new folder (2)hlsdk23_msvc20081src_dllcl_dllhud.h(689): error C4430: missing type specifier - int assumed. Note: C++ does not support default-int
1>d:new folder (2)hlsdk23_msvc20081src_dllcl_dllhud.h(689): error C2078: too many initializers
1>d:new folder (2)hlsdk23_msvc20081src_dllcl_dllhud.h(698): error C2065: 'HudRadar' : undeclared identifier
1>d:new folder (2)hlsdk23_msvc20081src_dllcl_dllhud.h(698): error C3861: 'HOOK_MESSAGE': identifier not found
1>d:new folder (2)hlsdk23_msvc20081src_dllcl_dllhud.h(709): error C3861: 'UnpackRGB': identifier not found
1>d:new folder (2)hlsdk23_msvc20081src_dllcl_dllhud.h(722): error C2065: 'm_hRadarSpr' : undeclared identifier
1>d:new folder (2)hlsdk23_msvc20081src_dllcl_dllhud.h(731): error C3861: 'BEGIN_READ': identifier not found
1>d:new folder (2)hlsdk23_msvc20081src_dllcl_dllhud.h(734): error C3861: 'READ_BYTE': identifier not found
1>d:new folder (2)hlsdk23_msvc20081src_dllcl_dllhud.h(739): error C3861: 'READ_BYTE': identifier not found
1>d:new folder (2)hlsdk23_msvc20081src_dllcl_dllhud.h(740): error C3861: 'READ_BYTE': identifier not found
1>d:new folder (2)hlsdk23_msvc20081src_dllcl_dllhud.h(749): error C2065: 'm_hRadarSpr' : undeclared identifier
1>d:new folder (2)hlsdk23_msvc20081src_dllcl_dllhud.h(751): error C2065: 'm_hRadarSpr' : undeclared identifier
1>d:new folder (2)hlsdk23_msvc20081src_dllcl_dllhud.h(751): error C3861: 'LoadSprite': identifier not found
1>d:new folder (2)hlsdk23_msvc20081src_dllcl_dllhud.h(767): error C2065: 'm_hRadarSpr' : undeclared identifier
1>d:new folder (2)hlsdk23_msvc20081src_dllcl_dllhud.h(767): error C3861: 'SPR_Set': identifier not found
1>d:new folder (2)hlsdk23_msvc20081src_dllcl_dllhud.h(768): error C3861: 'SPR_DrawHoles': identifier not found
1> vgui_TeamFortressViewport.cpp
1>d:new folder (2)hlsdk23_msvc20081src_dllcl_dllhud.h(686): error C2146: syntax error : missing ';' before identifier 'm_hRadarSpr'
1>d:new folder (2)hlsdk23_msvc20081src_dllcl_dllhud.h(686): error C4430: missing type specifier - int assumed. Note: C++ does not support default-int
1>d:new folder (2)hlsdk23_msvc20081src_dllcl_dllhud.h(686): error C4430: missing type specifier - int assumed. Note: C++ does not support default-int
1>d:new folder (2)hlsdk23_msvc20081src_dllcl_dllhud.h(689): error C2065: 'm_HudRadar' : undeclared identifier
1>d:new folder (2)hlsdk23_msvc20081src_dllcl_dllhud.h(689): error C2065: 'HudRadar' : undeclared identifier
1>d:new folder (2)hlsdk23_msvc20081src_dllcl_dllhud.h(689): error C4430: missing type specifier - int assumed. Note: C++ does not support default-int
1>d:new folder (2)hlsdk23_msvc20081src_dllcl_dllhud.h(689): error C2078: too many initializers
1>d:new folder (2)hlsdk23_msvc20081src_dllcl_dllhud.h(698): error C2065: 'HudRadar' : undeclared identifier
1>d:new folder (2)hlsdk23_msvc20081src_dllcl_dllhud.h(698): error C3861: 'HOOK_MESSAGE': identifier not found
1>d:new folder (2)hlsdk23_msvc20081src_dllcl_dllhud.h(709): error C3861: 'UnpackRGB': identifier not found
1>d:new folder (2)hlsdk23_msvc20081src_dllcl_dllhud.h(722): error C2065: 'm_hRadarSpr' : undeclared identifier
1>d:new folder (2)hlsdk23_msvc20081src_dllcl_dllhud.h(731): error C3861: 'BEGIN_READ': identifier not found
1>d:new folder (2)hlsdk23_msvc20081src_dllcl_dllhud.h(734): error C3861: 'READ_BYTE': identifier not found
1>d:new folder (2)hlsdk23_msvc20081src_dllcl_dllhud.h(739): error C3861: 'READ_BYTE': identifier not found
1>d:new folder (2)hlsdk23_msvc20081src_dllcl_dllhud.h(740): error C3861: 'READ_BYTE': identifier not found
1>d:new folder (2)hlsdk23_msvc20081src_dllcl_dllhud.h(749): error C2065: 'm_hRadarSpr' : undeclared identifier
1>d:new folder (2)hlsdk23_msvc20081src_dllcl_dllhud.h(751): error C2065: 'm_hRadarSpr' : undeclared identifier
1>d:new folder (2)hlsdk23_msvc20081src_dllcl_dllhud.h(751): error C3861: 'LoadSprite': identifier not found
1>d:new folder (2)hlsdk23_msvc20081src_dllcl_dllhud.h(767): error C2065: 'm_hRadarSpr' : undeclared identifier
1>d:new folder (2)hlsdk23_msvc20081src_dllcl_dllhud.h(767): error C3861: 'SPR_Set': identifier not found
1>d:new folder (2)hlsdk23_msvc20081src_dllcl_dllhud.h(768): error C3861: 'SPR_DrawHoles': identifier not found
1> vgui_SpectatorPanel.cpp
1>d:new folder (2)hlsdk23_msvc20081src_dllcl_dllhud.h(686): error C2146: syntax error : missing ';' before identifier 'm_hRadarSpr'
1>d:new folder (2)hlsdk23_msvc20081src_dllcl_dllhud.h(686): error C4430: missing type specifier - int assumed. Note: C++ does not support default-int
1>d:new folder (2)hlsdk23_msvc20081src_dllcl_dllhud.h(686): error C4430: missing type specifier - int assumed. Note: C++ does not support default-int
1>d:new folder (2)hlsdk23_msvc20081src_dllcl_dllhud.h(689): error C2065: 'm_HudRadar' : undeclared identifier
1>d:new folder (2)hlsdk23_msvc20081src_dllcl_dllhud.h(689): error C2065: 'HudRadar' : undeclared identifier
1>d:new folder (2)hlsdk23_msvc20081src_dllcl_dllhud.h(689): error C4430: missing type specifier - int assumed. Note: C++ does not support default-int
1>d:new folder (2)hlsdk23_msvc20081src_dllcl_dllhud.h(689): error C2078: too many initializers
1>d:new folder (2)hlsdk23_msvc20081src_dllcl_dllhud.h(698): error C2065: 'HudRadar' : undeclared identifier
1>d:new folder (2)hlsdk23_msvc20081src_dllcl_dllhud.h(698): error C3861: 'HOOK_MESSAGE': identifier not found
1>d:new folder (2)hlsdk23_msvc20081src_dllcl_dllhud.h(709): error C3861: 'UnpackRGB': identifier not found
1>d:new folder (2)hlsdk23_msvc20081src_dllcl_dllhud.h(722): error C2065: 'm_hRadarSpr' : undeclared identifier
1>d:new folder (2)hlsdk23_msvc20081src_dllcl_dllhud.h(731): error C3861: 'BEGIN_READ': identifier not found
1>d:new folder (2)hlsdk23_msvc20081src_dllcl_dllhud.h(734): error C3861: 'READ_BYTE': identifier not found
1>d:new folder (2)hlsdk23_msvc20081src_dllcl_dllhud.h(739): error C3861: 'READ_BYTE': identifier not found
1>d:new folder (2)hlsdk23_msvc20081src_dllcl_dllhud.h(740): error C3861: 'READ_BYTE': identifier not found
1>d:new folder (2)hlsdk23_msvc20081src_dllcl_dllhud.h(749): error C2065: 'm_hRadarSpr' : undeclared identifier
1>d:new folder (2)hlsdk23_msvc20081src_dllcl_dllhud.h(751): error C2065: 'm_hRadarSpr' : undeclared identifier
1>d:new folder (2)hlsdk23_msvc20081src_dllcl_dllhud.h(751): error C3861: 'LoadSprite': identifier not found
1>d:new folder (2)hlsdk23_msvc20081src_dllcl_dllhud.h(767): error C2065: 'm_hRadarSpr' : undeclared identifier
1>d:new folder (2)hlsdk23_msvc20081src_dllcl_dllhud.h(767): error C3861: 'SPR_Set': identifier not found
1>d:new folder (2)hlsdk23_msvc20081src_dllcl_dllhud.h(768): error C3861: 'SPR_DrawHoles': identifier not found
1> vgui_ServerBrowser.cpp
1>d:new folder (2)hlsdk23_msvc20081src_dllcl_dllhud.h(686): error C2146: syntax error : missing ';' before identifier 'm_hRadarSpr'
1>d:new folder (2)hlsdk23_msvc20081src_dllcl_dllhud.h(686): error C4430: missing type specifier - int assumed. Note: C++ does not support default-int
1>d:new folder (2)hlsdk23_msvc20081src_dllcl_dllhud.h(686): error C4430: missing type specifier - int assumed. Note: C++ does not support default-int
1>d:new folder (2)hlsdk23_msvc20081src_dllcl_dllhud.h(689): error C2065: 'm_HudRadar' : undeclared identifier
1>d:new folder (2)hlsdk23_msvc20081src_dllcl_dllhud.h(689): error C2065: 'HudRadar' : undeclared identifier
1>d:new folder (2)hlsdk23_msvc20081src_dllcl_dllhud.h(689): error C4430: missing type specifier - int assumed. Note: C++ does not support default-int
1>d:new folder (2)hlsdk23_msvc20081src_dllcl_dllhud.h(689): error C2078: too many initializers
1>d:new folder (2)hlsdk23_msvc20081src_dllcl_dllhud.h(698): error C2065: 'HudRadar' : undeclared identifier
1>d:new folder (2)hlsdk23_msvc20081src_dllcl_dllhud.h(698): error C3861: 'HOOK_MESSAGE': identifier not found
1>d:new folder (2)hlsdk23_msvc20081src_dllcl_dllhud.h(709): error C3861: 'UnpackRGB': identifier not found
1>d:new folder (2)hlsdk23_msvc20081src_dllcl_dllhud.h(722): error C2065: 'm_hRadarSpr' : undeclared identifier
1>d:new folder (2)hlsdk23_msvc20081src_dllcl_dllhud.h(731): error C3861: 'BEGIN_READ': identifier not found
1>d:new folder (2)hlsdk23_msvc20081src_dllcl_dllhud.h(734): error C3861: 'READ_BYTE': identifier not found
1>d:new folder (2)hlsdk23_msvc20081src_dllcl_dllhud.h(739): error C3861: 'READ_BYTE': identifier not found
1>d:new folder (2)hlsdk23_msvc20081src_dllcl_dllhud.h(740): error C3861: 'READ_BYTE': identifier not found
1>d:new folder (2)hlsdk23_msvc20081src_dllcl_dllhud.h(749): error C2065: 'm_hRadarSpr' : undeclared identifier
1>d:new folder (2)hlsdk23_msvc20081src_dllcl_dllhud.h(751): error C2065: 'm_hRadarSpr' : undeclared identifier
1>d:new folder (2)hlsdk23_msvc20081src_dllcl_dllhud.h(751): error C3861: 'LoadSprite': identifier not found
1>d:new folder (2)hlsdk23_msvc20081src_dllcl_dllhud.h(767): error C2065: 'm_hRadarSpr' : undeclared identifier
1>d:new folder (2)hlsdk23_msvc20081src_dllcl_dllhud.h(767): error C3861: 'SPR_Set': identifier not found
1>d:new folder (2)hlsdk23_msvc20081src_dllcl_dllhud.h(768): error C3861: 'SPR_DrawHoles': identifier not found
1> vgui_ScorePanel.cpp
1>d:new folder (2)hlsdk23_msvc20081src_dllcl_dllhud.h(686): error C2146: syntax error : missing ';' before identifier 'm_hRadarSpr'
1>d:new folder (2)hlsdk23_msvc20081src_dllcl_dllhud.h(686): error C4430: missing type specifier - int assumed. Note: C++ does not support default-int
1>d:new folder (2)hlsdk23_msvc20081src_dllcl_dllhud.h(686): error C4430: missing type specifier - int assumed. Note: C++ does not support default-int
1>d:new folder (2)hlsdk23_msvc20081src_dllcl_dllhud.h(689): error C2065: 'm_HudRadar' : undeclared identifier
1>d:new folder (2)hlsdk23_msvc20081src_dllcl_dllhud.h(689): error C2065: 'HudRadar' : undeclared identifier
1>d:new folder (2)hlsdk23_msvc20081src_dllcl_dllhud.h(689): error C4430: missing type specifier - int assumed. Note: C++ does not support default-int
1>d:new folder (2)hlsdk23_msvc20081src_dllcl_dllhud.h(689): error C2078: too many initializers
1>d:new folder (2)hlsdk23_msvc20081src_dllcl_dllhud.h(698): error C2065: 'HudRadar' : undeclared identifier
1>d:new folder (2)hlsdk23_msvc20081src_dllcl_dllhud.h(698): error C3861: 'HOOK_MESSAGE': identifier not found
1>d:new folder (2)hlsdk23_msvc20081src_dllcl_dllhud.h(709): error C3861: 'UnpackRGB': identifier not found
1>d:new folder (2)hlsdk23_msvc20081src_dllcl_dllhud.h(722): error C2065: 'm_hRadarSpr' : undeclared identifier
1>d:new folder (2)hlsdk23_msvc20081src_dllcl_dllhud.h(731): error C3861: 'BEGIN_READ': identifier not found
1>d:new folder (2)hlsdk23_msvc20081src_dllcl_dllhud.h(734): error C3861: 'READ_BYTE': identifier not found
1>d:new folder (2)hlsdk23_msvc20081src_dllcl_dllhud.h(739): error C3861: 'READ_BYTE': identifier not found
1>d:new folder (2)hlsdk23_msvc20081src_dllcl_dllhud.h(740): error C3861: 'READ_BYTE': identifier not found
1>d:new folder (2)hlsdk23_msvc20081src_dllcl_dllhud.h(749): error C2065: 'm_hRadarSpr' : undeclared identifier
1>d:new folder (2)hlsdk23_msvc20081src_dllcl_dllhud.h(751): error C2065: 'm_hRadarSpr' : undeclared identifier
1>d:new folder (2)hlsdk23_msvc20081src_dllcl_dllhud.h(751): error C3861: 'LoadSprite': identifier not found
1>d:new folder (2)hlsdk23_msvc20081src_dllcl_dllhud.h(767): error C2065: 'm_hRadarSpr' : undeclared identifier
1>d:new folder (2)hlsdk23_msvc20081src_dllcl_dllhud.h(767): error C3861: 'SPR_Set': identifier not found
1>d:new folder (2)hlsdk23_msvc20081src_dllcl_dllhud.h(768): error C3861: 'SPR_DrawHoles': identifier not found
1> vgui_SchemeManager.cpp
1>d:new folder (2)hlsdk23_msvc20081src_dllcl_dllhud.h(686): error C2146: syntax error : missing ';' before identifier 'm_hRadarSpr'
1>d:new folder (2)hlsdk23_msvc20081src_dllcl_dllhud.h(686): error C4430: missing type specifier - int assumed. Note: C++ does not support default-int
1>d:new folder (2)hlsdk23_msvc20081src_dllcl_dllhud.h(686): error C4430: missing type specifier - int assumed. Note: C++ does not support default-int
1>d:new folder (2)hlsdk23_msvc20081src_dllcl_dllhud.h(689): error C2065: 'm_HudRadar' : undeclared identifier
1>d:new folder (2)hlsdk23_msvc20081src_dllcl_dllhud.h(689): error C2065: 'HudRadar' : undeclared identifier
1>d:new folder (2)hlsdk23_msvc20081src_dllcl_dllhud.h(689): error C4430: missing type specifier - int assumed. Note: C++ does not support default-int
1>d:new folder (2)hlsdk23_msvc20081src_dllcl_dllhud.h(689): error C2078: too many initializers
1>d:new folder (2)hlsdk23_msvc20081src_dllcl_dllhud.h(698): error C2065: 'HudRadar' : undeclared identifier
1>d:new folder (2)hlsdk23_msvc20081src_dllcl_dllhud.h(698): error C3861: 'HOOK_MESSAGE': identifier not found
1>d:new folder (2)hlsdk23_msvc20081src_dllcl_dllhud.h(709): error C3861: 'UnpackRGB': identifier not found
1>d:new folder (2)hlsdk23_msvc20081src_dllcl_dllhud.h(722): error C2065: 'm_hRadarSpr' : undeclared identifier
1>d:new folder (2)hlsdk23_msvc20081src_dllcl_dllhud.h(731): error C3861: 'BEGIN_READ': identifier not found
1>d:new folder (2)hlsdk23_msvc20081src_dllcl_dllhud.h(734): error C3861: 'READ_BYTE': identifier not found
1>d:new folder (2)hlsdk23_msvc20081src_dllcl_dllhud.h(739): error C3861: 'READ_BYTE': identifier not found
1>d:new folder (2)hlsdk23_msvc20081src_dllcl_dllhud.h(740): error C3861: 'READ_BYTE': identifier not found
1>d:new folder (2)hlsdk23_msvc20081src_dllcl_dllhud.h(749): error C2065: 'm_hRadarSpr' : undeclared identifier
1>d:new folder (2)hlsdk23_msvc20081src_dllcl_dllhud.h(751): error C2065: 'm_hRadarSpr' : undeclared identifier
1>d:new folder (2)hlsdk23_msvc20081src_dllcl_dllhud.h(751): error C3861: 'LoadSprite': identifier not found
1>d:new folder (2)hlsdk23_msvc20081src_dllcl_dllhud.h(767): error C2065: 'm_hRadarSpr' : undeclared identifier
1>d:new folder (2)hlsdk23_msvc20081src_dllcl_dllhud.h(767): error C3861: 'SPR_Set': identifier not found
1>d:new folder (2)hlsdk23_msvc20081src_dllcl_dllhud.h(768): error C3861: 'SPR_DrawHoles': identifier not found
1> vgui_MOTDWindow.cpp
1>d:new folder (2)hlsdk23_msvc20081src_dllcl_dllhud.h(686): error C2146: syntax error : missing ';' before identifier 'm_hRadarSpr'
1>d:new folder (2)hlsdk23_msvc20081src_dllcl_dllhud.h(686): error C4430: missing type specifier - int assumed. Note: C++ does not support default-int
1>d:new folder (2)hlsdk23_msvc20081src_dllcl_dllhud.h(686): error C4430: missing type specifier - int assumed. Note: C++ does not support default-int
1>d:new folder (2)hlsdk23_msvc20081src_dllcl_dllhud.h(689): error C2065: 'm_HudRadar' : undeclared identifier
1>d:new folder (2)hlsdk23_msvc20081src_dllcl_dllhud.h(689): error C2065: 'HudRadar' : undeclared identifier
1>d:new folder (2)hlsdk23_msvc20081src_dllcl_dllhud.h(689): error C4430: missing type specifier - int assumed. Note: C++ does not support default-int
1>d:new folder (2)hlsdk23_msvc20081src_dllcl_dllhud.h(689): error C2078: too many initializers
1>d:new folder (2)hlsdk23_msvc20081src_dllcl_dllhud.h(698): error C2065: 'HudRadar' : undeclared identifier
1>d:new folder (2)hlsdk23_msvc20081src_dllcl_dllhud.h(698): error C3861: 'HOOK_MESSAGE': identifier not found
1>d:new folder (2)hlsdk23_msvc20081src_dllcl_dllhud.h(709): error C3861: 'UnpackRGB': identifier not found
1>d:new folder (2)hlsdk23_msvc20081src_dllcl_dllhud.h(722): error C2065: 'm_hRadarSpr' : undeclared identifier
1>d:new folder (2)hlsdk23_msvc20081src_dllcl_dllhud.h(731): error C3861: 'BEGIN_READ': identifier not found
1>d:new folder (2)hlsdk23_msvc20081src_dllcl_dllhud.h(734): error C3861: 'READ_BYTE': identifier not found
1>d:new folder (2)hlsdk23_msvc20081src_dllcl_dllhud.h(739): error C3861: 'READ_BYTE': identifier not found
1>d:new folder (2)hlsdk23_msvc20081src_dllcl_dllhud.h(740): error C3861: 'READ_BYTE': identifier not found
1>d:new folder (2)hlsdk23_msvc20081src_dllcl_dllhud.h(749): error C2065: 'm_hRadarSpr' : undeclared identifier
1>d:new folder (2)hlsdk23_msvc20081src_dllcl_dllhud.h(751): error C2065: 'm_hRadarSpr' : undeclared identifier
1>d:new folder (2)hlsdk23_msvc20081src_dllcl_dllhud.h(751): error C3861: 'LoadSprite': identifier not found
1>d:new folder (2)hlsdk23_msvc20081src_dllcl_dllhud.h(767): error C2065: 'm_hRadarSpr' : undeclared identifier
1>d:new folder (2)hlsdk23_msvc20081src_dllcl_dllhud.h(767): error C3861: 'SPR_Set': identifier not found
1>d:new folder (2)hlsdk23_msvc20081src_dllcl_dllhud.h(768): error C3861: 'SPR_DrawHoles': identifier not found
1> vgui_CustomObjects.cpp
1>d:new folder (2)hlsdk23_msvc20081src_dllcl_dllhud.h(686): error C2146: syntax error : missing ';' before identifier 'm_hRadarSpr'
1>d:new folder (2)hlsdk23_msvc20081src_dllcl_dllhud.h(686): error C4430: missing type specifier - int assumed. Note: C++ does not support default-int
1>d:new folder (2)hlsdk23_msvc20081src_dllcl_dllhud.h(686): error C4430: missing type specifier - int assumed. Note: C++ does not support default-int
1>d:new folder (2)hlsdk23_msvc20081src_dllcl_dllhud.h(689): error C2065: 'm_HudRadar' : undeclared identifier
1>d:new folder (2)hlsdk23_msvc20081src_dllcl_dllhud.h(689): error C2065: 'HudRadar' : undeclared identifier
1>d:new folder (2)hlsdk23_msvc20081src_dllcl_dllhud.h(689): error C4430: missing type specifier - int assumed. Note: C++ does not support default-int
1>d:new folder (2)hlsdk23_msvc20081src_dllcl_dllhud.h(689): error C2078: too many initializers
1>d:new folder (2)hlsdk23_msvc20081src_dllcl_dllhud.h(698): error C2065: 'HudRadar' : undeclared identifier
1>d:new folder (2)hlsdk23_msvc20081src_dllcl_dllhud.h(698): error C3861: 'HOOK_MESSAGE': identifier not found
1>d:new folder (2)hlsdk23_msvc20081src_dllcl_dllhud.h(709): error C3861: 'UnpackRGB': identifier not found
1>d:new folder (2)hlsdk23_msvc20081src_dllcl_dllhud.h(722): error C2065: 'm_hRadarSpr' : undeclared identifier
1>d:new folder (2)hlsdk23_msvc20081src_dllcl_dllhud.h(731): error C3861: 'BEGIN_READ': identifier not found
1>d:new folder (2)hlsdk23_msvc20081src_dllcl_dllhud.h(734): error C3861: 'READ_BYTE': identifier not found
1>d:new folder (2)hlsdk23_msvc20081src_dllcl_dllhud.h(739): error C3861: 'READ_BYTE': identifier not found
1>d:new folder (2)hlsdk23_msvc20081src_dllcl_dllhud.h(740): error C3861: 'READ_BYTE': identifier not found
1>d:new folder (2)hlsdk23_msvc20081src_dllcl_dllhud.h(749): error C2065: 'm_hRadarSpr' : undeclared identifier
1>d:new folder (2)hlsdk23_msvc20081src_dllcl_dllhud.h(751): error C2065: 'm_hRadarSpr' : undeclared identifier
1>d:new folder (2)hlsdk23_msvc20081src_dllcl_dllhud.h(751): error C3861: 'LoadSprite': identifier not found
1>d:new folder (2)hlsdk23_msvc20081src_dllcl_dllhud.h(767): error C2065: 'm_hRadarSpr' : undeclared identifier
1>d:new folder (2)hlsdk23_msvc20081src_dllcl_dllhud.h(767): error C3861: 'SPR_Set': identifier not found
1>d:new folder (2)hlsdk23_msvc20081src_dllcl_dllhud.h(768): error C3861: 'SPR_DrawHoles': identifier not found
1> vgui_ConsolePanel.cpp
1>d:new folder (2)hlsdk23_msvc20081src_dllcl_dllhud.h(686): error C2146: syntax error : missing ';' before identifier 'm_hRadarSpr'
1>d:new folder (2)hlsdk23_msvc20081src_dllcl_dllhud.h(686): error C4430: missing type specifier - int assumed. Note: C++ does not support default-int
1>d:new folder (2)hlsdk23_msvc20081src_dllcl_dllhud.h(686): error C4430: missing type specifier - int assumed. Note: C++ does not support default-int
1>d:new folder (2)hlsdk23_msvc20081src_dllcl_dllhud.h(689): error C2065: 'm_HudRadar' : undeclared identifier
1>d:new folder (2)hlsdk23_msvc20081src_dllcl_dllhud.h(689): error C2065: 'HudRadar' : undeclared identifier
1>d:new folder (2)hlsdk23_msvc20081src_dllcl_dllhud.h(689): error C4430: missing type specifier - int assumed. Note: C++ does not support default-int
1>d:new folder (2)hlsdk23_msvc20081src_dllcl_dllhud.h(689): error C2078: too many initializers
1>d:new folder (2)hlsdk23_msvc20081src_dllcl_dllhud.h(698): error C2065: 'HudRadar' : undeclared identifier
1>d:new folder (2)hlsdk23_msvc20081src_dllcl_dllhud.h(698): error C3861: 'HOOK_MESSAGE': identifier not found
1>d:new folder (2)hlsdk23_msvc20081src_dllcl_dllhud.h(709): error C3861: 'UnpackRGB': identifier not found
1>d:new folder (2)hlsdk23_msvc20081src_dllcl_dllhud.h(722): error C2065: 'm_hRadarSpr' : undeclared identifier
1>d:new folder (2)hlsdk23_msvc20081src_dllcl_dllhud.h(731): error C3861: 'BEGIN_READ': identifier not found
1>d:new folder (2)hlsdk23_msvc20081src_dllcl_dllhud.h(734): error C3861: 'READ_BYTE': identifier not found
1>d:new folder (2)hlsdk23_msvc20081src_dllcl_dllhud.h(739): error C3861: 'READ_BYTE': identifier not found
1>d:new folder (2)hlsdk23_msvc20081src_dllcl_dllhud.h(740): error C3861: 'READ_BYTE': identifier not found
1>d:new folder (2)hlsdk23_msvc20081src_dllcl_dllhud.h(749): error C2065: 'm_hRadarSpr' : undeclared identifier
1>d:new folder (2)hlsdk23_msvc20081src_dllcl_dllhud.h(751): error C2065: 'm_hRadarSpr' : undeclared identifier
1>d:new folder (2)hlsdk23_msvc20081src_dllcl_dllhud.h(751): error C3861: 'LoadSprite': identifier not found
1>d:new folder (2)hlsdk23_msvc20081src_dllcl_dllhud.h(767): error C2065: 'm_hRadarSpr' : undeclared identifier
1>d:new folder (2)hlsdk23_msvc20081src_dllcl_dllhud.h(767): error C3861: 'SPR_Set': identifier not found
1>d:new folder (2)hlsdk23_msvc20081src_dllcl_dllhud.h(768): error C3861: 'SPR_DrawHoles': identifier not found
1> vgui_ClassMenu.cpp
1>d:new folder (2)hlsdk23_msvc20081src_dllcl_dllhud.h(686): error C2146: syntax error : missing ';' before identifier 'm_hRadarSpr'
1>d:new folder (2)hlsdk23_msvc20081src_dllcl_dllhud.h(686): error C4430: missing type specifier - int assumed. Note: C++ does not support default-int
1>d:new folder (2)hlsdk23_msvc20081src_dllcl_dllhud.h(686): error C4430: missing type specifier - int assumed. Note: C++ does not support default-int
1>d:new folder (2)hlsdk23_msvc20081src_dllcl_dllhud.h(689): error C2065: 'm_HudRadar' : undeclared identifier
1>d:new folder (2)hlsdk23_msvc20081src_dllcl_dllhud.h(689): error C2065: 'HudRadar' : undeclared identifier
1>d:new folder (2)hlsdk23_msvc20081src_dllcl_dllhud.h(689): error C4430: missing type specifier - int assumed. Note: C++ does not support default-int
1>d:new folder (2)hlsdk23_msvc20081src_dllcl_dllhud.h(689): error C2078: too many initializers
1>d:new folder (2)hlsdk23_msvc20081src_dllcl_dllhud.h(698): error C2065: 'HudRadar' : undeclared identifier
1>d:new folder (2)hlsdk23_msvc20081src_dllcl_dllhud.h(698): error C3861: 'HOOK_MESSAGE': identifier not found
1>d:new folder (2)hlsdk23_msvc20081src_dllcl_dllhud.h(709): error C3861: 'UnpackRGB': identifier not found
1>d:new folder (2)hlsdk23_msvc20081src_dllcl_dllhud.h(722): error C2065: 'm_hRadarSpr' : undeclared identifier
1>d:new folder (2)hlsdk23_msvc20081src_dllcl_dllhud.h(731): error C3861: 'BEGIN_READ': identifier not found
1>d:new folder (2)hlsdk23_msvc20081src_dllcl_dllhud.h(734): error C3861: 'READ_BYTE': identifier not found
1>d:new folder (2)hlsdk23_msvc20081src_dllcl_dllhud.h(739): error C3861: 'READ_BYTE': identifier not found
1>d:new folder (2)hlsdk23_msvc20081src_dllcl_dllhud.h(740): error C3861: 'READ_BYTE': identifier not found
1>d:new folder (2)hlsdk23_msvc20081src_dllcl_dllhud.h(749): error C2065: 'm_hRadarSpr' : undeclared identifier
1>d:new folder (2)hlsdk23_msvc20081src_dllcl_dllhud.h(751): error C2065: 'm_hRadarSpr' : undeclared identifier
1>d:new folder (2)hlsdk23_msvc20081src_dllcl_dllhud.h(751): error C3861: 'LoadSprite': identifier not found
1>d:new folder (2)hlsdk23_msvc20081src_dllcl_dllhud.h(767): error C2065: 'm_hRadarSpr' : undeclared identifier
1>d:new folder (2)hlsdk23_msvc20081src_dllcl_dllhud.h(767): error C3861: 'SPR_Set': identifier not found
1>d:new folder (2)hlsdk23_msvc20081src_dllcl_dllhud.h(768): error C3861: 'SPR_DrawHoles': identifier not found
1> util.cpp
1>d:new folder (2)hlsdk23_msvc20081src_dllcl_dllhud.h(686): error C2146: syntax error : missing ';' before identifier 'm_hRadarSpr'
1>d:new folder (2)hlsdk23_msvc20081src_dllcl_dllhud.h(686): error C4430: missing type specifier - int assumed. Note: C++ does not support default-int
1>d:new folder (2)hlsdk23_msvc20081src_dllcl_dllhud.h(686): error C4430: missing type specifier - int assumed. Note: C++ does not support default-int
1>d:new folder (2)hlsdk23_msvc20081src_dllcl_dllhud.h(689): error C2065: 'm_HudRadar' : undeclared identifier
1>d:new folder (2)hlsdk23_msvc20081src_dllcl_dllhud.h(689): error C2065: 'HudRadar' : undeclared identifier
1>d:new folder (2)hlsdk23_msvc20081src_dllcl_dllhud.h(689): error C4430: missing type specifier - int assumed. Note: C++ does not support default-int
1>d:new folder (2)hlsdk23_msvc20081src_dllcl_dllhud.h(689): error C2078: too many initializers
1>d:new folder (2)hlsdk23_msvc20081src_dllcl_dllhud.h(698): error C2065: 'HudRadar' : undeclared identifier
1>d:new folder (2)hlsdk23_msvc20081src_dllcl_dllhud.h(698): error C3861: 'HOOK_MESSAGE': identifier not found
1>d:new folder (2)hlsdk23_msvc20081src_dllcl_dllhud.h(709): error C3861: 'UnpackRGB': identifier not found
1>d:new folder (2)hlsdk23_msvc20081src_dllcl_dllhud.h(722): error C2065: 'm_hRadarSpr' : undeclared identifier
1>d:new folder (2)hlsdk23_msvc20081src_dllcl_dllhud.h(731): error C3861: 'BEGIN_READ': identifier not found
1>d:new folder (2)hlsdk23_msvc20081src_dllcl_dllhud.h(734): error C3861: 'READ_BYTE': identifier not found
1>d:new folder (2)hlsdk23_msvc20081src_dllcl_dllhud.h(739): error C3861: 'READ_BYTE': identifier not found
1>d:new folder (2)hlsdk23_msvc20081src_dllcl_dllhud.h(740): error C3861: 'READ_BYTE': identifier not found
1>d:new folder (2)hlsdk23_msvc20081src_dllcl_dllhud.h(749): error C2065: 'm_hRadarSpr' : undeclared identifier
1>d:new folder (2)hlsdk23_msvc20081src_dllcl_dllhud.h(751): error C2065: 'm_hRadarSpr' : undeclared identifier
1>d:new folder (2)hlsdk23_msvc20081src_dllcl_dllhud.h(751): error C3861: 'LoadSprite': identifier not found
1>d:new folder (2)hlsdk23_msvc20081src_dllcl_dllhud.h(767): error C2065: 'm_hRadarSpr' : undeclared identifier
1>d:new folder (2)hlsdk23_msvc20081src_dllcl_dllhud.h(767): error C3861: 'SPR_Set': identifier not found
1>d:new folder (2)hlsdk23_msvc20081src_dllcl_dllhud.h(768): error C3861: 'SPR_DrawHoles': identifier not found
1> tri.cpp
1>d:new folder (2)hlsdk23_msvc20081src_dllcl_dllhud.h(686): error C2146: syntax error : missing ';' before identifier 'm_hRadarSpr'
1>d:new folder (2)hlsdk23_msvc20081src_dllcl_dllhud.h(686): error C4430: missing type specifier - int assumed. Note: C++ does not support default-int
1>d:new folder (2)hlsdk23_msvc20081src_dllcl_dllhud.h(686): error C4430: missing type specifier - int assumed. Note: C++ does not support default-int
1>d:new folder (2)hlsdk23_msvc20081src_dllcl_dllhud.h(689): error C2065: 'm_HudRadar' : undeclared identifier
1>d:new folder (2)hlsdk23_msvc20081src_dllcl_dllhud.h(689): error C2065: 'HudRadar' : undeclared identifier
1>d:new folder (2)hlsdk23_msvc20081src_dllcl_dllhud.h(689): error C4430: missing type specifier - int assumed. Note: C++ does not support default-int
1>d:new folder (2)hlsdk23_msvc20081src_dllcl_dllhud.h(689): error C2078: too many initializers
1>d:new folder (2)hlsdk23_msvc20081src_dllcl_dllhud.h(698): error C2065: 'HudRadar' : undeclared identifier
1>d:new folder (2)hlsdk23_msvc20081src_dllcl_dllhud.h(698): error C3861: 'HOOK_MESSAGE': identifier not found
1>d:new folder (2)hlsdk23_msvc20081src_dllcl_dllhud.h(709): error C3861: 'UnpackRGB': identifier not found
1>d:new folder (2)hlsdk23_msvc20081src_dllcl_dllhud.h(722): error C2065: 'm_hRadarSpr' : undeclared identifier
1>d:new folder (2)hlsdk23_msvc20081src_dllcl_dllhud.h(731): error C3861: 'BEGIN_READ': identifier not found
1>d:new folder (2)hlsdk23_msvc20081src_dllcl_dllhud.h(734): error C3861: 'READ_BYTE': identifier not found
1>d:new folder (2)hlsdk23_msvc20081src_dllcl_dllhud.h(739): error C3861: 'READ_BYTE': identifier not found
1>d:new folder (2)hlsdk23_msvc20081src_dllcl_dllhud.h(740): error C3861: 'READ_BYTE': identifier not found
1>d:new folder (2)hlsdk23_msvc20081src_dllcl_dllhud.h(749): error C2065: 'm_hRadarSpr' : undeclared identifier
1>d:new folder (2)hlsdk23_msvc20081src_dllcl_dllhud.h(751): error C2065: 'm_hRadarSpr' : undeclared identifier
1>d:new folder (2)hlsdk23_msvc20081src_dllcl_dllhud.h(751): error C3861: 'LoadSprite': identifier not found
1>d:new folder (2)hlsdk23_msvc20081src_dllcl_dllhud.h(767): error C2065: 'm_hRadarSpr' : undeclared identifier
1>d:new folder (2)hlsdk23_msvc20081src_dllcl_dllhud.h(767): error C3861: 'SPR_Set': identifier not found
1>d:new folder (2)hlsdk23_msvc20081src_dllcl_dllhud.h(768): error C3861: 'SPR_DrawHoles': identifier not found
1> train.cpp
1>d:new folder (2)hlsdk23_msvc20081src_dllcl_dllhud.h(686): error C2146: syntax error : missing ';' before identifier 'm_hRadarSpr'
1>d:new folder (2)hlsdk23_msvc20081src_dllcl_dllhud.h(686): error C4430: missing type specifier - int assumed. Note: C++ does not support default-int
1>d:new folder (2)hlsdk23_msvc20081src_dllcl_dllhud.h(686): error C4430: missing type specifier - int assumed. Note: C++ does not support default-int
1>d:new folder (2)hlsdk23_msvc20081src_dllcl_dllhud.h(689): error C2065: 'm_HudRadar' : undeclared identifier
1>d:new folder (2)hlsdk23_msvc20081src_dllcl_dllhud.h(689): error C2065: 'HudRadar' : undeclared identifier
1>d:new folder (2)hlsdk23_msvc20081src_dllcl_dllhud.h(689): error C4430: missing type specifier - int assumed. Note: C++ does not support default-int
1>d:new folder (2)hlsdk23_msvc20081src_dllcl_dllhud.h(689): error C2078: too many initializers
1>d:new folder (2)hlsdk23_msvc20081src_dllcl_dllhud.h(698): error C2065: 'HudRadar' : undeclared identifier
1>d:new folder (2)hlsdk23_msvc20081src_dllcl_dllhud.h(698): error C3861: 'HOOK_MESSAGE': identifier not found
1>d:new folder (2)hlsdk23_msvc20081src_dllcl_dllhud.h(709): error C3861: 'UnpackRGB': identifier not found
1>d:new folder (2)hlsdk23_msvc20081src_dllcl_dllhud.h(722): error C2065: 'm_hRadarSpr' : undeclared identifier
1>d:new folder (2)hlsdk23_msvc20081src_dllcl_dllhud.h(731): error C3861: 'BEGIN_READ': identifier not found
1>d:new folder (2)hlsdk23_msvc20081src_dllcl_dllhud.h(734): error C3861: 'READ_BYTE': identifier not found
1>d:new folder (2)hlsdk23_msvc20081src_dllcl_dllhud.h(739): error C3861: 'READ_BYTE': identifier not found
1>d:new folder (2)hlsdk23_msvc20081src_dllcl_dllhud.h(740): error C3861: 'READ_BYTE': identifier not found
1>d:new folder (2)hlsdk23_msvc20081src_dllcl_dllhud.h(749): error C2065: 'm_hRadarSpr' : undeclared identifier
1>d:new folder (2)hlsdk23_msvc20081src_dllcl_dllhud.h(751): error C2065: 'm_hRadarSpr' : undeclared identifier
1>d:new folder (2)hlsdk23_msvc20081src_dllcl_dllhud.h(751): error C3861: 'LoadSprite': identifier not found
1>d:new folder (2)hlsdk23_msvc20081src_dllcl_dllhud.h(767): error C2065: 'm_hRadarSpr' : undeclared identifier
1>d:new folder (2)hlsdk23_msvc20081src_dllcl_dllhud.h(767): error C3861: 'SPR_Set': identifier not found
1>d:new folder (2)hlsdk23_msvc20081src_dllcl_dllhud.h(768): error C3861: 'SPR_DrawHoles': identifier not found
1> text_message.cpp
1>d:new folder (2)hlsdk23_msvc20081src_dllcl_dllhud.h(686): error C2146: syntax error : missing ';' before identifier 'm_hRadarSpr'
1>d:new folder (2)hlsdk23_msvc20081src_dllcl_dllhud.h(686): error C4430: missing type specifier - int assumed. Note: C++ does not support default-int
1>d:new folder (2)hlsdk23_msvc20081src_dllcl_dllhud.h(686): error C4430: missing type specifier - int assumed. Note: C++ does not support default-int
1>d:new folder (2)hlsdk23_msvc20081src_dllcl_dllhud.h(689): error C2065: 'm_HudRadar' : undeclared identifier
1>d:new folder (2)hlsdk23_msvc20081src_dllcl_dllhud.h(689): error C2065: 'HudRadar' : undeclared identifier
1>d:new folder (2)hlsdk23_msvc20081src_dllcl_dllhud.h(689): error C4430: missing type specifier - int assumed. Note: C++ does not support default-int
1>d:new folder (2)hlsdk23_msvc20081src_dllcl_dllhud.h(689): error C2078: too many initializers
1>d:new folder (2)hlsdk23_msvc20081src_dllcl_dllhud.h(698): error C2065: 'HudRadar' : undeclared identifier
1>d:new folder (2)hlsdk23_msvc20081src_dllcl_dllhud.h(698): error C3861: 'HOOK_MESSAGE': identifier not found
1>d:new folder (2)hlsdk23_msvc20081src_dllcl_dllhud.h(709): error C3861: 'UnpackRGB': identifier not found
1>d:new folder (2)hlsdk23_msvc20081src_dllcl_dllhud.h(722): error C2065: 'm_hRadarSpr' : undeclared identifier
1>d:new folder (2)hlsdk23_msvc20081src_dllcl_dllhud.h(731): error C3861: 'BEGIN_READ': identifier not found
1>d:new folder (2)hlsdk23_msvc20081src_dllcl_dllhud.h(734): error C3861: 'READ_BYTE': identifier not found
1>d:new folder (2)hlsdk23_msvc20081src_dllcl_dllhud.h(739): error C3861: 'READ_BYTE': identifier not found
1>d:new folder (2)hlsdk23_msvc20081src_dllcl_dllhud.h(740): error C3861: 'READ_BYTE': identifier not found
1>d:new folder (2)hlsdk23_msvc20081src_dllcl_dllhud.h(749): error C2065: 'm_hRadarSpr' : undeclared identifier
1>d:new folder (2)hlsdk23_msvc20081src_dllcl_dllhud.h(751): error C2065: 'm_hRadarSpr' : undeclared identifier
1>d:new folder (2)hlsdk23_msvc20081src_dllcl_dllhud.h(751): error C3861: 'LoadSprite': identifier not found
1>d:new folder (2)hlsdk23_msvc20081src_dllcl_dllhud.h(767): error C2065: 'm_hRadarSpr' : undeclared identifier
1>d:new folder (2)hlsdk23_msvc20081src_dllcl_dllhud.h(767): error C3861: 'SPR_Set': identifier not found
1>d:new folder (2)hlsdk23_msvc20081src_dllcl_dllhud.h(768): error C3861: 'SPR_DrawHoles': identifier not found
1> studio_util.cpp
1>d:new folder (2)hlsdk23_msvc20081src_dllcl_dllhud.h(686): error C2146: syntax error : missing ';' before identifier 'm_hRadarSpr'
1>d:new folder (2)hlsdk23_msvc20081src_dllcl_dllhud.h(686): error C4430: missing type specifier - int assumed. Note: C++ does not support default-int
1>d:new folder (2)hlsdk23_msvc20081src_dllcl_dllhud.h(686): error C4430: missing type specifier - int assumed. Note: C++ does not support default-int
1>d:new folder (2)hlsdk23_msvc20081src_dllcl_dllhud.h(689): error C2065: 'm_HudRadar' : undeclared identifier
1>d:new folder (2)hlsdk23_msvc20081src_dllcl_dllhud.h(689): error C2065: 'HudRadar' : undeclared identifier
1>d:new folder (2)hlsdk23_msvc20081src_dllcl_dllhud.h(689): error C4430: missing type specifier - int assumed. Note: C++ does not support default-int
1>d:new folder (2)hlsdk23_msvc20081src_dllcl_dllhud.h(689): error C2078: too many initializers
1>d:new folder (2)hlsdk23_msvc20081src_dllcl_dllhud.h(698): error C2065: 'HudRadar' : undeclared identifier
1>d:new folder (2)hlsdk23_msvc20081src_dllcl_dllhud.h(698): error C3861: 'HOOK_MESSAGE': identifier not found
1>d:new folder (2)hlsdk23_msvc20081src_dllcl_dllhud.h(709): error C3861: 'UnpackRGB': identifier not found
1>d:new folder (2)hlsdk23_msvc20081src_dllcl_dllhud.h(722): error C2065: 'm_hRadarSpr' : undeclared identifier
1>d:new folder (2)hlsdk23_msvc20081src_dllcl_dllhud.h(731): error C3861: 'BEGIN_READ': identifier not found
1>d:new folder (2)hlsdk23_msvc20081src_dllcl_dllhud.h(734): error C3861: 'READ_BYTE': identifier not found
1>d:new folder (2)hlsdk23_msvc20081src_dllcl_dllhud.h(739): error C3861: 'READ_BYTE': identifier not found
1>d:new folder (2)hlsdk23_msvc20081src_dllcl_dllhud.h(740): error C3861: 'READ_BYTE': identifier not found
1>d:new folder (2)hlsdk23_msvc20081src_dllcl_dllhud.h(749): error C2065: 'm_hRadarSpr' : undeclared identifier
1>d:new folder (2)hlsdk23_msvc20081src_dllcl_dllhud.h(751): error C2065: 'm_hRadarSpr' : undeclared identifier
1>d:new folder (2)hlsdk23_msvc20081src_dllcl_dllhud.h(751): error C3861: 'LoadSprite': identifier not found
1>d:new folder (2)hlsdk23_msvc20081src_dllcl_dllhud.h(767): error C2065: 'm_hRadarSpr' : undeclared identifier
1>d:new folder (2)hlsdk23_msvc20081src_dllcl_dllhud.h(767): error C3861: 'SPR_Set': identifier not found
1>d:new folder (2)hlsdk23_msvc20081src_dllcl_dllhud.h(768): error C3861: 'SPR_DrawHoles': identifier not found
1> statusbar.cpp
1>d:new folder (2)hlsdk23_msvc20081src_dllcl_dllhud.h(686): error C2146: syntax error : missing ';' before identifier 'm_hRadarSpr'
1>d:new folder (2)hlsdk23_msvc20081src_dllcl_dllhud.h(686): error C4430: missing type specifier - int assumed. Note: C++ does not support default-int
1>d:new folder (2)hlsdk23_msvc20081src_dllcl_dllhud.h(686): error C4430: missing type specifier - int assumed. Note: C++ does not support default-int
1>d:new folder (2)hlsdk23_msvc20081src_dllcl_dllhud.h(689): error C2065: 'm_HudRadar' : undeclared identifier
1>d:new folder (2)hlsdk23_msvc20081src_dllcl_dllhud.h(689): error C2065: 'HudRadar' : undeclared identifier
1>d:new folder (2)hlsdk23_msvc20081src_dllcl_dllhud.h(689): error C4430: missing type specifier - int assumed. Note: C++ does not support default-int
1>d:new folder (2)hlsdk23_msvc20081src_dllcl_dllhud.h(689): error C2078: too many initializers
1>d:new folder (2)hlsdk23_msvc20081src_dllcl_dllhud.h(698): error C2065: 'HudRadar' : undeclared identifier
1>d:new folder (2)hlsdk23_msvc20081src_dllcl_dllhud.h(698): error C3861: 'HOOK_MESSAGE': identifier not found
1>d:new folder (2)hlsdk23_msvc20081src_dllcl_dllhud.h(709): error C3861: 'UnpackRGB': identifier not found
1>d:new folder (2)hlsdk23_msvc20081src_dllcl_dllhud.h(722): error C2065: 'm_hRadarSpr' : undeclared identifier
1>d:new folder (2)hlsdk23_msvc20081src_dllcl_dllhud.h(731): error C3861: 'BEGIN_READ': identifier not found
1>d:new folder (2)hlsdk23_msvc20081src_dllcl_dllhud.h(734): error C3861: 'READ_BYTE': identifier not found
1>d:new folder (2)hlsdk23_msvc20081src_dllcl_dllhud.h(739): error C3861: 'READ_BYTE': identifier not found
1>d:new folder (2)hlsdk23_msvc20081src_dllcl_dllhud.h(740): error C3861: 'READ_BYTE': identifier not found
1>d:new folder (2)hlsdk23_msvc20081src_dllcl_dllhud.h(749): error C2065: 'm_hRadarSpr' : undeclared identifier
1>d:new folder (2)hlsdk23_msvc20081src_dllcl_dllhud.h(751): error C2065: 'm_hRadarSpr' : undeclared identifier
1>d:new folder (2)hlsdk23_msvc20081src_dllcl_dllhud.h(751): error C3861: 'LoadSprite': identifier not found
1>d:new folder (2)hlsdk23_msvc20081src_dllcl_dllhud.h(767): error C2065: 'm_hRadarSpr' : undeclared identifier
1>d:new folder (2)hlsdk23_msvc20081src_dllcl_dllhud.h(767): error C3861: 'SPR_Set': identifier not found
1>d:new folder (2)hlsdk23_msvc20081src_dllcl_dllhud.h(768): error C3861: 'SPR_DrawHoles': identifier not found
1> status_icons.cpp
1>d:new folder (2)hlsdk23_msvc20081src_dllcl_dllhud.h(686): error C2146: syntax error : missing ';' before identifier 'm_hRadarSpr'
1>d:new folder (2)hlsdk23_msvc20081src_dllcl_dllhud.h(686): error C4430: missing type specifier - int assumed. Note: C++ does not support default-int
1>d:new folder (2)hlsdk23_msvc20081src_dllcl_dllhud.h(686): error C4430: missing type specifier - int assumed. Note: C++ does not support default-int
1>d:new folder (2)hlsdk23_msvc20081src_dllcl_dllhud.h(689): error C2065: 'm_HudRadar' : undeclared identifier
1>d:new folder (2)hlsdk23_msvc20081src_dllcl_dllhud.h(689): error C2065: 'HudRadar' : undeclared identifier
1>d:new folder (2)hlsdk23_msvc20081src_dllcl_dllhud.h(689): error C4430: missing type specifier - int assumed. Note: C++ does not support default-int
1>d:new folder (2)hlsdk23_msvc20081src_dllcl_dllhud.h(689): error C2078: too many initializers
1>d:new folder (2)hlsdk23_msvc20081src_dllcl_dllhud.h(698): error C2065: 'HudRadar' : undeclared identifier
1>d:new folder (2)hlsdk23_msvc20081src_dllcl_dllhud.h(698): error C3861: 'HOOK_MESSAGE': identifier not found
1>d:new folder (2)hlsdk23_msvc20081src_dllcl_dllhud.h(709): error C3861: 'UnpackRGB': identifier not found
1>d:new folder (2)hlsdk23_msvc20081src_dllcl_dllhud.h(722): error C2065: 'm_hRadarSpr' : undeclared identifier
1>d:new folder (2)hlsdk23_msvc20081src_dllcl_dllhud.h(731): error C3861: 'BEGIN_READ': identifier not found
1>d:new folder (2)hlsdk23_msvc20081src_dllcl_dllhud.h(734): error C3861: 'READ_BYTE': identifier not found
1>d:new folder (2)hlsdk23_msvc20081src_dllcl_dllhud.h(739): error C3861: 'READ_BYTE': identifier not found
1>d:new folder (2)hlsdk23_msvc20081src_dllcl_dllhud.h(740): error C3861: 'READ_BYTE': identifier not found
1>d:new folder (2)hlsdk23_msvc20081src_dllcl_dllhud.h(749): error C2065: 'm_hRadarSpr' : undeclared identifier
1>d:new folder (2)hlsdk23_msvc20081src_dllcl_dllhud.h(751): error C2065: 'm_hRadarSpr' : undeclared identifier
1>d:new folder (2)hlsdk23_msvc20081src_dllcl_dllhud.h(751): error C3861: 'LoadSprite': identifier not found
1>d:new folder (2)hlsdk23_msvc20081src_dllcl_dllhud.h(767): error C2065: 'm_hRadarSpr' : undeclared identifier
1>d:new folder (2)hlsdk23_msvc20081src_dllcl_dllhud.h(767): error C3861: 'SPR_Set': identifier not found
1>d:new folder (2)hlsdk23_msvc20081src_dllcl_dllhud.h(768): error C3861: 'SPR_DrawHoles': identifier not found
1> saytext.cpp
1>d:new folder (2)hlsdk23_msvc20081src_dllcl_dllhud.h(686): error C2146: syntax error : missing ';' before identifier 'm_hRadarSpr'
1>d:new folder (2)hlsdk23_msvc20081src_dllcl_dllhud.h(686): error C4430: missing type specifier - int assumed. Note: C++ does not support default-int
1>d:new folder (2)hlsdk23_msvc20081src_dllcl_dllhud.h(686): error C4430: missing type specifier - int assumed. Note: C++ does not support default-int
1>d:new folder (2)hlsdk23_msvc20081src_dllcl_dllhud.h(689): error C2065: 'm_HudRadar' : undeclared identifier
1>d:new folder (2)hlsdk23_msvc20081src_dllcl_dllhud.h(689): error C2065: 'HudRadar' : undeclared identifier
1>d:new folder (2)hlsdk23_msvc20081src_dllcl_dllhud.h(689): error C4430: missing type specifier - int assumed. Note: C++ does not support default-int
1>d:new folder (2)hlsdk23_msvc20081src_dllcl_dllhud.h(689): error C2078: too many initializers
1>d:new folder (2)hlsdk23_msvc20081src_dllcl_dllhud.h(698): error C2065: 'HudRadar' : undeclared identifier
1>d:new folder (2)hlsdk23_msvc20081src_dllcl_dllhud.h(698): error C3861: 'HOOK_MESSAGE': identifier not found
1>d:new folder (2)hlsdk23_msvc20081src_dllcl_dllhud.h(709): error C3861: 'UnpackRGB': identifier not found
1>d:new folder (2)hlsdk23_msvc20081src_dllcl_dllhud.h(722): error C2065: 'm_hRadarSpr' : undeclared identifier
1>d:new folder (2)hlsdk23_msvc20081src_dllcl_dllhud.h(731): error C3861: 'BEGIN_READ': identifier not found
1>d:new folder (2)hlsdk23_msvc20081src_dllcl_dllhud.h(734): error C3861: 'READ_BYTE': identifier not found
1>d:new folder (2)hlsdk23_msvc20081src_dllcl_dllhud.h(739): error C3861: 'READ_BYTE': identifier not found
1>d:new folder (2)hlsdk23_msvc20081src_dllcl_dllhud.h(740): error C3861: 'READ_BYTE': identifier not found
1>d:new folder (2)hlsdk23_msvc20081src_dllcl_dllhud.h(749): error C2065: 'm_hRadarSpr' : undeclared identifier
1>d:new folder (2)hlsdk23_msvc20081src_dllcl_dllhud.h(751): error C2065: 'm_hRadarSpr' : undeclared identifier
1>d:new folder (2)hlsdk23_msvc20081src_dllcl_dllhud.h(751): error C3861: 'LoadSprite': identifier not found
1>d:new folder (2)hlsdk23_msvc20081src_dllcl_dllhud.h(767): error C2065: 'm_hRadarSpr' : undeclared identifier
1>d:new folder (2)hlsdk23_msvc20081src_dllcl_dllhud.h(767): error C3861: 'SPR_Set': identifier not found
1>d:new folder (2)hlsdk23_msvc20081src_dllcl_dllhud.h(768): error C3861: 'SPR_DrawHoles': identifier not found
1> Generating Code...
1> Compiling...
1> message.cpp
1>d:new folder (2)hlsdk23_msvc20081src_dllcl_dllhud.h(686): error C2146: syntax error : missing ';' before identifier 'm_hRadarSpr'
1>d:new folder (2)hlsdk23_msvc20081src_dllcl_dllhud.h(686): error C4430: missing type specifier - int assumed. Note: C++ does not support default-int
1>d:new folder (2)hlsdk23_msvc20081src_dllcl_dllhud.h(686): error C4430: missing type specifier - int assumed. Note: C++ does not support default-int
1>d:new folder (2)hlsdk23_msvc20081src_dllcl_dllhud.h(689): error C2065: 'm_HudRadar' : undeclared identifier
1>d:new folder (2)hlsdk23_msvc20081src_dllcl_dllhud.h(689): error C2065: 'HudRadar' : undeclared identifier
1>d:new folder (2)hlsdk23_msvc20081src_dllcl_dllhud.h(689): error C4430: missing type specifier - int assumed. Note: C++ does not support default-int
1>d:new folder (2)hlsdk23_msvc20081src_dllcl_dllhud.h(689): error C2078: too many initializers
1>d:new folder (2)hlsdk23_msvc20081src_dllcl_dllhud.h(698): error C2065: 'HudRadar' : undeclared identifier
1>d:new folder (2)hlsdk23_msvc20081src_dllcl_dllhud.h(698): error C3861: 'HOOK_MESSAGE': identifier not found
1>d:new folder (2)hlsdk23_msvc20081src_dllcl_dllhud.h(709): error C3861: 'UnpackRGB': identifier not found
1>d:new folder (2)hlsdk23_msvc20081src_dllcl_dllhud.h(722): error C2065: 'm_hRadarSpr' : undeclared identifier
1>d:new folder (2)hlsdk23_msvc20081src_dllcl_dllhud.h(731): error C3861: 'BEGIN_READ': identifier not found
1>d:new folder (2)hlsdk23_msvc20081src_dllcl_dllhud.h(734): error C3861: 'READ_BYTE': identifier not found
1>d:new folder (2)hlsdk23_msvc20081src_dllcl_dllhud.h(739): error C3861: 'READ_BYTE': identifier not found
1>d:new folder (2)hlsdk23_msvc20081src_dllcl_dllhud.h(740): error C3861: 'READ_BYTE': identifier not found
1>d:new folder (2)hlsdk23_msvc20081src_dllcl_dllhud.h(749): error C2065: 'm_hRadarSpr' : undeclared identifier
1>d:new folder (2)hlsdk23_msvc20081src_dllcl_dllhud.h(751): error C2065: 'm_hRadarSpr' : undeclared identifier
1>d:new folder (2)hlsdk23_msvc20081src_dllcl_dllhud.h(751): error C3861: 'LoadSprite': identifier not found
1>d:new folder (2)hlsdk23_msvc20081src_dllcl_dllhud.h(767): error C2065: 'm_hRadarSpr' : undeclared identifier
1>d:new folder (2)hlsdk23_msvc20081src_dllcl_dllhud.h(767): error C3861: 'SPR_Set': identifier not found
1>d:new folder (2)hlsdk23_msvc20081src_dllcl_dllhud.h(768): error C3861: 'SPR_DrawHoles': identifier not found
1> menu.cpp
1>d:new folder (2)hlsdk23_msvc20081src_dllcl_dllhud.h(686): error C2146: syntax error : missing ';' before identifier 'm_hRadarSpr'
1>d:new folder (2)hlsdk23_msvc20081src_dllcl_dllhud.h(686): error C4430: missing type specifier - int assumed. Note: C++ does not support default-int
1>d:new folder (2)hlsdk23_msvc20081src_dllcl_dllhud.h(686): error C4430: missing type specifier - int assumed. Note: C++ does not support default-int
1>d:new folder (2)hlsdk23_msvc20081src_dllcl_dllhud.h(689): error C2065: 'm_HudRadar' : undeclared identifier
1>d:new folder (2)hlsdk23_msvc20081src_dllcl_dllhud.h(689): error C2065: 'HudRadar' : undeclared identifier
1>d:new folder (2)hlsdk23_msvc20081src_dllcl_dllhud.h(689): error C4430: missing type specifier - int assumed. Note: C++ does not support default-int
1>d:new folder (2)hlsdk23_msvc20081src_dllcl_dllhud.h(689): error C2078: too many initializers
1>d:new folder (2)hlsdk23_msvc20081src_dllcl_dllhud.h(698): error C2065: 'HudRadar' : undeclared identifier
1>d:new folder (2)hlsdk23_msvc20081src_dllcl_dllhud.h(698): error C3861: 'HOOK_MESSAGE': identifier not found
1>d:new folder (2)hlsdk23_msvc20081src_dllcl_dllhud.h(709): error C3861: 'UnpackRGB': identifier not found
1>d:new folder (2)hlsdk23_msvc20081src_dllcl_dllhud.h(722): error C2065: 'm_hRadarSpr' : undeclared identifier
1>d:new folder (2)hlsdk23_msvc20081src_dllcl_dllhud.h(731): error C3861: 'BEGIN_READ': identifier not found
1>d:new folder (2)hlsdk23_msvc20081src_dllcl_dllhud.h(734): error C3861: 'READ_BYTE': identifier not found
1>d:new folder (2)hlsdk23_msvc20081src_dllcl_dllhud.h(739): error C3861: 'READ_BYTE': identifier not found
1>d:new folder (2)hlsdk23_msvc20081src_dllcl_dllhud.h(740): error C3861: 'READ_BYTE': identifier not found
1>d:new folder (2)hlsdk23_msvc20081src_dllcl_dllhud.h(749): error C2065: 'm_hRadarSpr' : undeclared identifier
1>d:new folder (2)hlsdk23_msvc20081src_dllcl_dllhud.h(751): error C2065: 'm_hRadarSpr' : undeclared identifier
1>d:new folder (2)hlsdk23_msvc20081src_dllcl_dllhud.h(751): error C3861: 'LoadSprite': identifier not found
1>d:new folder (2)hlsdk23_msvc20081src_dllcl_dllhud.h(767): error C2065: 'm_hRadarSpr' : undeclared identifier
1>d:new folder (2)hlsdk23_msvc20081src_dllcl_dllhud.h(767): error C3861: 'SPR_Set': identifier not found
1>d:new folder (2)hlsdk23_msvc20081src_dllcl_dllhud.h(768): error C3861: 'SPR_DrawHoles': identifier not found
1> inputw32.cpp
1>d:new folder (2)hlsdk23_msvc20081src_dllcl_dllhud.h(686): error C2146: syntax error : missing ';' before identifier 'm_hRadarSpr'
1>d:new folder (2)hlsdk23_msvc20081src_dllcl_dllhud.h(686): error C4430: missing type specifier - int assumed. Note: C++ does not support default-int
1>d:new folder (2)hlsdk23_msvc20081src_dllcl_dllhud.h(686): error C4430: missing type specifier - int assumed. Note: C++ does not support default-int
1>d:new folder (2)hlsdk23_msvc20081src_dllcl_dllhud.h(689): error C2065: 'm_HudRadar' : undeclared identifier
1>d:new folder (2)hlsdk23_msvc20081src_dllcl_dllhud.h(689): error C2065: 'HudRadar' : undeclared identifier
1>d:new folder (2)hlsdk23_msvc20081src_dllcl_dllhud.h(689): error C4430: missing type specifier - int assumed. Note: C++ does not support default-int
1>d:new folder (2)hlsdk23_msvc20081src_dllcl_dllhud.h(689): error C2078: too many initializers
1>d:new folder (2)hlsdk23_msvc20081src_dllcl_dllhud.h(698): error C2065: 'HudRadar' : undeclared identifier
1>d:new folder (2)hlsdk23_msvc20081src_dllcl_dllhud.h(698): error C3861: 'HOOK_MESSAGE': identifier not found
1>d:new folder (2)hlsdk23_msvc20081src_dllcl_dllhud.h(709): error C3861: 'UnpackRGB': identifier not found
1>d:new folder (2)hlsdk23_msvc20081src_dllcl_dllhud.h(722): error C2065: 'm_hRadarSpr' : undeclared identifier
1>d:new folder (2)hlsdk23_msvc20081src_dllcl_dllhud.h(731): error C3861: 'BEGIN_READ': identifier not found
1>d:new folder (2)hlsdk23_msvc20081src_dllcl_dllhud.h(734): error C3861: 'READ_BYTE': identifier not found
1>d:new folder (2)hlsdk23_msvc20081src_dllcl_dllhud.h(739): error C3861: 'READ_BYTE': identifier not found
1>d:new folder (2)hlsdk23_msvc20081src_dllcl_dllhud.h(740): error C3861: 'READ_BYTE': identifier not found
1>d:new folder (2)hlsdk23_msvc20081src_dllcl_dllhud.h(749): error C2065: 'm_hRadarSpr' : undeclared identifier
1>d:new folder (2)hlsdk23_msvc20081src_dllcl_dllhud.h(751): error C2065: 'm_hRadarSpr' : undeclared identifier
1>d:new folder (2)hlsdk23_msvc20081src_dllcl_dllhud.h(751): error C3861: 'LoadSprite': identifier not found
1>d:new folder (2)hlsdk23_msvc20081src_dllcl_dllhud.h(767): error C2065: 'm_hRadarSpr' : undeclared identifier
1>d:new folder (2)hlsdk23_msvc20081src_dllcl_dllhud.h(767): error C3861: 'SPR_Set': identifier not found
1>d:new folder (2)hlsdk23_msvc20081src_dllcl_dllhud.h(768): error C3861: 'SPR_DrawHoles': identifier not found
1> input.cpp
1>d:new folder (2)hlsdk23_msvc20081src_dllcl_dllhud.h(686): error C2146: syntax error : missing ';' before identifier 'm_hRadarSpr'
1>d:new folder (2)hlsdk23_msvc20081src_dllcl_dllhud.h(686): error C4430: missing type specifier - int assumed. Note: C++ does not support default-int
1>d:new folder (2)hlsdk23_msvc20081src_dllcl_dllhud.h(686): error C4430: missing type specifier - int assumed. Note: C++ does not support default-int
1>d:new folder (2)hlsdk23_msvc20081src_dllcl_dllhud.h(689): error C2065: 'm_HudRadar' : undeclared identifier
1>d:new folder (2)hlsdk23_msvc20081src_dllcl_dllhud.h(689): error C2065: 'HudRadar' : undeclared identifier
1>d:new folder (2)hlsdk23_msvc20081src_dllcl_dllhud.h(689): error C4430: missing type specifier - int assumed. Note: C++ does not support default-int
1>d:new folder (2)hlsdk23_msvc20081src_dllcl_dllhud.h(689): error C2078: too many initializers
1>d:new folder (2)hlsdk23_msvc20081src_dllcl_dllhud.h(698): error C2065: 'HudRadar' : undeclared identifier
1>d:new folder (2)hlsdk23_msvc20081src_dllcl_dllhud.h(698): error C3861: 'HOOK_MESSAGE': identifier not found
1>d:new folder (2)hlsdk23_msvc20081src_dllcl_dllhud.h(709): error C3861: 'UnpackRGB': identifier not found
1>d:new folder (2)hlsdk23_msvc20081src_dllcl_dllhud.h(722): error C2065: 'm_hRadarSpr' : undeclared identifier
1>d:new folder (2)hlsdk23_msvc20081src_dllcl_dllhud.h(731): error C3861: 'BEGIN_READ': identifier not found
1>d:new folder (2)hlsdk23_msvc20081src_dllcl_dllhud.h(734): error C3861: 'READ_BYTE': identifier not found
1>d:new folder (2)hlsdk23_msvc20081src_dllcl_dllhud.h(739): error C3861: 'READ_BYTE': identifier not found
1>d:new folder (2)hlsdk23_msvc20081src_dllcl_dllhud.h(740): error C3861: 'READ_BYTE': identifier not found
1>d:new folder (2)hlsdk23_msvc20081src_dllcl_dllhud.h(749): error C2065: 'm_hRadarSpr' : undeclared identifier
1>d:new folder (2)hlsdk23_msvc20081src_dllcl_dllhud.h(751): error C2065: 'm_hRadarSpr' : undeclared identifier
1>d:new folder (2)hlsdk23_msvc20081src_dllcl_dllhud.h(751): error C3861: 'LoadSprite': identifier not found
1>d:new folder (2)hlsdk23_msvc20081src_dllcl_dllhud.h(767): error C2065: 'm_hRadarSpr' : undeclared identifier
1>d:new folder (2)hlsdk23_msvc20081src_dllcl_dllhud.h(767): error C3861: 'SPR_Set': identifier not found
1>d:new folder (2)hlsdk23_msvc20081src_dllcl_dllhud.h(768): error C3861: 'SPR_DrawHoles': identifier not found
1> in_camera.cpp
1>d:new folder (2)hlsdk23_msvc20081src_dllcl_dllhud.h(686): error C2146: syntax error : missing ';' before identifier 'm_hRadarSpr'
1>d:new folder (2)hlsdk23_msvc20081src_dllcl_dllhud.h(686): error C4430: missing type specifier - int assumed. Note: C++ does not support default-int
1>d:new folder (2)hlsdk23_msvc20081src_dllcl_dllhud.h(686): error C4430: missing type specifier - int assumed. Note: C++ does not support default-int
1>d:new folder (2)hlsdk23_msvc20081src_dllcl_dllhud.h(689): error C2065: 'm_HudRadar' : undeclared identifier
1>d:new folder (2)hlsdk23_msvc20081src_dllcl_dllhud.h(689): error C2065: 'HudRadar' : undeclared identifier
1>d:new folder (2)hlsdk23_msvc20081src_dllcl_dllhud.h(689): error C4430: missing type specifier - int assumed. Note: C++ does not support default-int
1>d:new folder (2)hlsdk23_msvc20081src_dllcl_dllhud.h(689): error C2078: too many initializers
1>d:new folder (2)hlsdk23_msvc20081src_dllcl_dllhud.h(698): error C2065: 'HudRadar' : undeclared identifier
1>d:new folder (2)hlsdk23_msvc20081src_dllcl_dllhud.h(698): error C3861: 'HOOK_MESSAGE': identifier not found
1>d:new folder (2)hlsdk23_msvc20081src_dllcl_dllhud.h(709): error C3861: 'UnpackRGB': identifier not found
1>d:new folder (2)hlsdk23_msvc20081src_dllcl_dllhud.h(722): error C2065: 'm_hRadarSpr' : undeclared identifier
1>d:new folder (2)hlsdk23_msvc20081src_dllcl_dllhud.h(731): error C3861: 'BEGIN_READ': identifier not found
1>d:new folder (2)hlsdk23_msvc20081src_dllcl_dllhud.h(734): error C3861: 'READ_BYTE': identifier not found
1>d:new folder (2)hlsdk23_msvc20081src_dllcl_dllhud.h(739): error C3861: 'READ_BYTE': identifier not found
1>d:new folder (2)hlsdk23_msvc20081src_dllcl_dllhud.h(740): error C3861: 'READ_BYTE': identifier not found
1>d:new folder (2)hlsdk23_msvc20081src_dllcl_dllhud.h(749): error C2065: 'm_hRadarSpr' : undeclared identifier
1>d:new folder (2)hlsdk23_msvc20081src_dllcl_dllhud.h(751): error C2065: 'm_hRadarSpr' : undeclared identifier
1>d:new folder (2)hlsdk23_msvc20081src_dllcl_dllhud.h(751): error C3861: 'LoadSprite': identifier not found
1>d:new folder (2)hlsdk23_msvc20081src_dllcl_dllhud.h(767): error C2065: 'm_hRadarSpr' : undeclared identifier
1>d:new folder (2)hlsdk23_msvc20081src_dllcl_dllhud.h(767): error C3861: 'SPR_Set': identifier not found
1>d:new folder (2)hlsdk23_msvc20081src_dllcl_dllhud.h(768): error C3861: 'SPR_DrawHoles': identifier not found
1> hud_update.cpp
1>d:new folder (2)hlsdk23_msvc20081src_dllcl_dllhud.h(686): error C2146: syntax error : missing ';' before identifier 'm_hRadarSpr'
1>d:new folder (2)hlsdk23_msvc20081src_dllcl_dllhud.h(686): error C4430: missing type specifier - int assumed. Note: C++ does not support default-int
1>d:new folder (2)hlsdk23_msvc20081src_dllcl_dllhud.h(686): error C4430: missing type specifier - int assumed. Note: C++ does not support default-int
1>d:new folder (2)hlsdk23_msvc20081src_dllcl_dllhud.h(689): error C2065: 'm_HudRadar' : undeclared identifier
1>d:new folder (2)hlsdk23_msvc20081src_dllcl_dllhud.h(689): error C2065: 'HudRadar' : undeclared identifier
1>d:new folder (2)hlsdk23_msvc20081src_dllcl_dllhud.h(689): error C4430: missing type specifier - int assumed. Note: C++ does not support default-int
1>d:new folder (2)hlsdk23_msvc20081src_dllcl_dllhud.h(689): error C2078: too many initializers
1>d:new folder (2)hlsdk23_msvc20081src_dllcl_dllhud.h(698): error C2065: 'HudRadar' : undeclared identifier
1>d:new folder (2)hlsdk23_msvc20081src_dllcl_dllhud.h(698):
Posted 10 years ago2011-08-20 10:28:10 UTC
in create a radar in half-life sdk? Post #298232
How to create a radar in half-life sdk a radar just like in counter strike 1.6?
I found this link:
vs49688.tk/tuts/
viewtut.php?id=50
but i had many errors on the code when I compile it :(
Posted 10 years ago2011-08-17 11:26:53 UTC
in (Gman) look at this! Post #298105
when I watched this movie couple of times, I've noticed the he looks like
Gman...
en.wikipedia.org/wiki/Race_to_Witch_Mountain
Posted 10 years ago2011-08-17 11:20:57 UTC
in (Gman) look at this! Post #298103
en.wikipedia.org/wiki/File:Ciaran_hinds.jpg

en.wikipedia.org/wiki/Ciar%C3%A1n_Hinds

Fixed links ^_^
Posted 10 years ago2011-08-17 09:07:37 UTC
in (Gman) look at this! Post #298095
Hellow,
I am thinking if this guy look like Gman in the Half-life 2
here's the picture and link
h**p://en.wikipedia.org/wiki/File:Ciaran_hinds.jpg
LinK:
h**p://en.wikipedia.org/wiki/Ciar%C3%A1n_Hinds

for me it looks like hes Gman in the real person
...
Posted 10 years ago2011-08-14 04:12:08 UTC
in how to make the player big, half-life SD Post #297915
tnx
Posted 10 years ago2011-08-13 09:18:34 UTC
in how to make the player big, half-life SD Post #297860
because I am modifying the whole hl.dll and creating a mod.
Posted 10 years ago2011-08-12 08:15:28 UTC
in how to make the player big, half-life SD Post #297780
and also how do I code new weapons i already have models, I found some weapon
creating threads, forums and other sources but they are not working anymore :(

weapons to create:
knife
pipewrench
hammer
Posted 10 years ago2011-08-12 06:41:54 UTC
in how to make the player big, half-life SD Post #297772
Hellow,
How do I code the player to make it big, because I am creating a mod
the guy is a huge man, strong man.

I just need the code for the player to make it big player.
Code:
UTIL_SetSize = I dont know if this is the size of other monsterss
but the player, i mean Gordon.

I am currently using Half-Life SDK 2.2
VC++ 2008 Express
Posted 11 years ago2011-08-04 12:55:54 UTC
in How to create a missile/rocket in VHE 3. Post #297354
ok tnx fr the advices :)
Posted 11 years ago2011-08-04 09:52:59 UTC
in How to create a missile/rocket in VHE 3. Post #297346
Hellow
I am just trying to create a map and a missile control center in valve hammer editor 3.5
How am i gonna create the missile or rocket thingy...
a missile/rocket in Half-Life is located at the "On A Rail" Chapter of Half-lIfe
type in the console: map c2a2h and then when you pressed the launch button
the missile is launched how can I create thet? ...
Posted 11 years ago2011-07-31 02:47:47 UTC
in [help] modify turret.cpp half-life sdk Post #297188
I think I ask many questions...
How to change the Sentry Turret Bullets to Uranium bullets?
turret.cpp

...

I think there is a gauss turret...

Sorry if I am starting new threads...
Posted 11 years ago2011-07-30 09:28:13 UTC
in [help] How to change the sentry turret b Post #297165
I think I ask many questions...
How to change the Sentry Turret Bullets to Uranium bullets?
turret.cpp

...

I think there is a gauss turret...
Posted 11 years ago2011-07-30 01:51:18 UTC
in [Help] turrets, human assasin, barney, h Post #297156
thanks again :)
Posted 11 years ago2011-07-29 12:52:15 UTC
in [Help] turrets, human assasin, barney, h Post #297117
From the Previous Thread:
http://twhl.info/forums.php?thread=17644&

A little help please the hgrunt and barney are shooting the turrets how do I remove this and the turrets are not shooting the human assasin
how do I edit the codes of
hgrunt.cpp
monsters.cpp
etc.
help...
I dont have any experience in programming in c++

...
I think that this is my last question... :)

BUGBUGBUG
Posted 11 years ago2011-07-29 10:33:53 UTC
in [help] modify turret.cpp half-life sdk Post #297116
Dexter, a little help please the hgrunt and barney are shooting the turrets how do I remove this and the turrets are not shooting the human assasin
help...
I dont have any experience in programming in c++
Posted 11 years ago2011-07-28 13:15:16 UTC
in [help] modify turret.cpp half-life sdk Post #297090
tnx